{"text_format":"1","workbook":"xlsx","n_sheets":11,"sheets":["User Guide","Information","AT-Matrix","Checklist","Risk analysis","Table 7-1 Time","Table 7-2 Expertise","Table 7-3 Knowledge","Table 7-4 Opportunity","Table 7-5 Equipment","System"],"not_rendered":{"charts":0,"images":0,"macros":1,"external_links":0,"defined_names":18,"comments":1,"pivot_tables":0},"unopened":[],"bounds":{"document_bytes":16777216,"sheet_cells":100000,"rows_first":2000,"rows_last":500,"rows_between":2000,"halvings":0,"cell_chars":16384,"cell_head_chars":4096},"cells_cut":0,"cells_raw":0,"read":"whole","date_system":"1900"}

{"sheet":"User Guide","index":0,"n_rows":42,"n_cols":1,"rows_kept":42,"cut":false,"hidden":false,"merged":[[0,0,0,9],[20,0,20,9],[21,0,24,9],[41,0,42,9],[1,0,3,9],[4,0,6,9],[38,0,39,9],[34,0,36,9],[25,0,27,9],[29,0,32,9],[10,0,10,9],[17,0,18,9],[8,0,8,9]]}
[{"$f":"MSDocTitle","v":"Software risk analysis according to WELMEC Guide 7.6 chapter 4.1"}]
["How to use this template"]
[]
[]
["This document is intended to simplify the risk analysis and its evaluation process according to WELMEC Guide 7.6, issue 2021. It can replace the Annex I, which is used for a risk analysis according to chapter 4.1 of the guide. The guide contains definitions of generic attack vectors and common assets that need to be protected and secured. The main goal is to demonstrate the completeness of the risk analysis. This document uses extensive tables to list all these attack vectors and the common assets.  In case all combinations of assets and attack vectors are covered by acceptable solutions, this document can be considered a sufficient risk analysis."]
[]
[]
[]
["General information about the manufacturer and the measuring instrument can be entered in the tab \"Information\". There you can also find the section \"Document history\" to list changes and additions made during the evaluation process."]
[]
["The risk analysis itself begins in the tab \"AT-Matrix. There, the “Assets-Threats-Matrix” can be found, which is derived from WELMEC Guide 7.6 and should reflect the architecture of the measuring instrument. It lists the assets to be protected (software, parameters, measurement result, …) in its numbered rows. The table “Assets-Threats-Matrix” is slightly modified compared to WELMEC Guide 7.6, as software itself was added as an asset. This deviation simplifies the documentation of  protection measures for each of the other assets. The columns contain the threats/attack vectors (other software, user interface, communication interface, ...), that might apply to each of the assets. When left-clicking on the cell where the asset row and the threat column cross, a drop down menu opens. In the menu it can be chosen how the threat is covered. The options are:"]
[]
[]
[]
[]
[]
[]
["If the measuring instrument has, for example, no external communication interface, \"NA\" can be chosen in the drop down menu in the tab \"AT-Matrix\" for the columns \"I\" and \"J\".  If the threat is covered by an acceptable solution, \"AS\" should be chosen. In case of a new solution that is not yet covered by WELMEC Guide 7.2, a risk analysis according to WELMEC Guide 7.6 chapter 4.2 should be executed by the manufacturer and provided together with the documentation of the measuring instrument. The lines regarding Asset No. 3 in the AT-Matrix \"Protection of measurement result\" are already set to \"NA\", as the following sections on records and transmission of measurement data should cover all attack vectors. If additional protection of measurement results is needed, this can be changed."]
[]
[]
{"$rows_left_out":23}
{"sheet":"Information","index":1,"n_rows":14,"n_cols":9,"rows_kept":14,"cut":false,"hidden":false,"merged":[[15,4,15,7],[1,8,1,15],[2,8,21,15],[0,1,0,3],[0,8,0,15],[21,4,21,7],[11,1,11,7],[4,1,4,2],[4,6,4,7],[5,1,5,7],[7,1,7,2],[19,4,19,7],[20,4,20,7],[2,1,2,2],[2,6,2,7],[14,4,14,7],[3,6,3,7],[8,1,8,2],[9,1,9,2],[10,1,10,2],[6,1,6,7],[7,3,7,7],[13,4,13,7],[12,1,12,7],[18,4,18,7],[0,4,0,7],[8,3,8,7],[9,3,9,7],[10,3,10,7],[1,4,1,5],[2,4,2,5],[3,4,3,5],[4,4,4,5],[1,1,1,3],[1,6,1,7],[3,1,3,2],[16,4,16,7],[17,4,17,7]]}
[null,{"$f":"MSDocTitle","v":"Software risk analysis according to WELMEC Guide 7.6 chapter 4.1"},null,null,"Conformity assessment body\nAddress",null,null,null,{"$f":"MSRefNr & \" / V\" & MSRevNr  & \" / \" & MSRevDate","v":"6030.55F01 / V1.8 / 15.05.2025"}]
[null,"Applicant or manufacturer:",null,null,"Authors:",null,"Roles:",null,"General remarks (Line feed with <Alt> + <Enter>)"]
[null,"Name:"]
[null,"Address:"]
[null,"Job number:"]
[]
[null,"Project description:"]
[null,"Instrument type:"]
[null,"Software designation:"]
[null,"Software version:"]
[null,"Comments:"]
[]
[null,"Document history:"]
[null,"Version: ","Date: ","Description:","Remarks:"]

{"sheet":"AT-Matrix","index":2,"n_rows":20,"n_cols":22,"rows_kept":20,"cut":false,"hidden":false,"merged":[[18,1,18,2],[1,1,2,3],[4,4,15,4],[3,5,3,20]]}
[]
[null,"Assets-Threats-Matrix derived from WELMEC Guide 7.2: 2026\n\nThreats consist of at least one asset and one corresponding statement of which security property (availability, integrity and/or authenticity) can be invalidated by the threat by means of an attack vector.",null,null,"  Attack Vector","Inadmissible influence on the measurement process by executing other functions","Inadmissible influence via user interfaces","Inadmissible influence via the boot process","Inadmissible influence via the administration of the operating system","Inadmissible influence via legally non-relevant software","Inadmissible influence by obtaining confidential information","Inadmissible influence by replacing physical parts within the measuring instrument","Inadmissible influence via hardware interfaces","Inadmissible influence by downloading legally relevant software","Inadmissible influence by replacing or removing legally relevant components","Inadmissible influence by man-in-the-middle attacks","Inadmissible influence due to accidental modification","Inadmissible influence by incorrect software identification","Additional attack vector 1","Additional attack vector 2","Additional attack vector 3"]
[null,null,null,null,"No.","IIP1","III1","IIB1","IIA1","IIN1","IIC1","IIR1","III2","IID1","IIR2","IIT1","IIA2","IIS1","IIX1","IIX2","IIX3"]
[null,"Asset No.","Assets/Properties"]
[null,1,"software in EVSE",null,null,"4.3.1.1","4.4.1.1","NA","NA","NA","4.4.1.1","4.8.1.1","4.4.1.1","NA","4.5.2","NA","4.4.1","4.6.1","-","-","-","-"]
[null,{"$f":"B5+1","v":2},"parameters in EVSE",null,null,"4.3.1.1","4.4.1.1","NA","NA","NA","4.4.1.1","4.8.1.1","4.4.1.1","NA","4.5.2","NA","4.4.1","4.6.1","-","-","-","-"]
[null,{"$f":"B6+1","v":3},"measurement data in EVSE",null,null,"4.3.1.1","4.4.1.1","NA","NA","NA","4.4.1.1","4.8.1.1","4.4.1.1","NA","4.5.2","NA","4.4.1","4.6.1","-","-","-","-"]
[null,4,"measurement result in EVSE",null,null,"4.3.1.1","4.4.1.1","NA","NA","NA","4.4.1.1","4.8.1.1","4.4.1.1","NA","4.5.2","NA","4.4.1","4.6.1","-","-","-","-"]
[null,5,"inscriptions for component EVSE",null,null,"4.3.1.1","4.4.1.1","NA","NA","NA","4.4.1.1","4.8.1.1","4.4.1.1","NA","4.5.2","NA","4.4.1","4.6.1","-","-","-","-"]
[null,6,"evidence of an intervention in EVSE",null,null,"4.3.1.1","4.4.1.1","NA","NA","NA","4.4.1.1","4.8.1.1","4.4.1.1","NA","4.5.2","NA","4.4.1","4.6.1","-","-","-","-"]
[null,7,"measurement data transmitted from EVSE to BYOD",null,null,"NA","NA","NA","NA","NA","NA","NA","NA","NA","NA","4.5.3","NA","NA","-","-","-","-"]
[null,{"$f":"B11+1","v":8},"software in BYOD",null,null,"NA","4.4.1.1","NA","4.5.4","4.5.4","4.7.1","NA","4.4.1.1","NA","4.5.2","NA","4.4.1","4.6.1","-","-","-","-"]
[null,{"$f":"B12+1","v":9},"parameters in component B",null,null,"NA","NA","NA","NA","NA","NA","NA","NA","NA","NA","NA","NA","NA","-","-","-","-"]
[null,10,"measurement data in component B",null,null,"NA","NA","NA","NA","NA","NA","NA","NA","NA","NA","NA","NA","NA","-","-","-","-"]
[null,11,"measurement result in BYOD",null,null,"NA","4.4.1.1","NA","4.5.4","4.5.4","4.7.1","NA","4.4.1.1","NA","4.5.2","NA","4.4.1","4.6.1","-","-","-","-"]
[null,12,"inscriptions for component B",null,null,"NA","NA","NA","NA","NA","NA","NA","NA","NA","NA","NA","NA","NA","-","-","-","-"]
[null,{"$f":"B16+1","v":13},"evidence of intervention in component B",null,null,"NA","NA","NA","NA","NA","NA","NA","NA","NA","NA","NA","NA","NA","-","-","-","-"]
[]
[null,"To add an asset, press <Ctrl+Shift+a>!"]
[null,"Comments"]
{"$rows_left_out":1}
{"sheet":"Checklist","index":3,"n_rows":213,"n_cols":12,"rows_kept":213,"cut":false,"hidden":false,"merged":[[1,7,3,11],[85,0,100,0],[69,0,84,0],[53,0,68,0],[37,0,52,0],[21,0,36,0],[5,0,20,0],[181,0,196,0],[165,0,180,0],[149,0,164,0],[3,1,3,5],[1,1,1,5],[2,1,2,5],[133,0,148,0],[117,0,132,0],[101,0,116,0]]}
[]
[null,"Annex A - Checklists for Generic Attack Probability Trees "]
[null,"Introduction to checklist:"]
[null,"As stated in 4.1, for simple instruments, for all generic threats with high-level attack vectors that correspond to an acceptable solution or are not applicable, no point score need to be provided for the attack vectors. Instead this checklist can be used. For the generic threats with high-level attack vectors, gereric AtPTs are found in 3.4.1. These correspond to the following checklists.\nIn the column \"Break down threat\", an explication is required on how the attack could be performed. Each threat defined shall correspond to a counter measure, which can be either an acceptable solution from WELMEC 7.2 or an explanation to why it is not applicable. The Notified Body is later responsible for assessing for every countermeasure that it is acceptable. "]
[null,"Asset No.","Attack No.","Asset \ndescription","Attack vector\ndescription","Security property","Description / examples","Countermeasure","Break down attack vector for specific instrument design","Passed / Failed","Solution","Remarks / Attack ID for RA"]
[null,1,"IIP1",{"$f":"INDIRECT(\"'AT-Matrix'!C$\" & INT(B6 + 4))","v":"software in EVSE"},"Inadmissible influence on the measurement process through executing other functions","integrity, authenticity, availability",null,null,null,null,{"$f":"'AT-Matrix'!F5","v":"4.3.1.1"}]
[null,1,"III1","software in EVSE","Inadmissible influence through user interfaces","integrity, authenticity, availability",null,null,null,null,{"$f":"'AT-Matrix'!G5","v":"4.4.1.1"}]
[null,1,"IIB1","software in EVSE","Inadmissible influence through the boot process","integrity, authenticity, availability",null,null,null,null,{"$f":"'AT-Matrix'!H5","v":"NA"}]
[null,1,"IIA1","software in EVSE","Inadmissible influence through the administration of the operating system","integrity, authenticity, availability",null,null,null,null,{"$f":"'AT-Matrix'!I5","v":"NA"}]
[null,1,"IIN1","software in EVSE","Inadmissible influence through legally non-relevant software","integrity, authenticity, availability",null,null,null,null,{"$f":"'AT-Matrix'!J5","v":"NA"}]
[null,1,"IIC1","software in EVSE","Inadmissible influence through obtaining confidential information","integrity, authenticity, availability",null,null,null,null,{"$f":"'AT-Matrix'!K5","v":"4.4.1.1"}]
[null,1,"IIR1","software in EVSE","Inadmissible influence through replacing parts within the measuring instrument","integrity, authenticity, availability",null,null,null,null,{"$f":"'AT-Matrix'!L5","v":"4.8.1.1"}]
[null,1,"III2","software in EVSE","Inadmissible influence through hardware interfaces","integrity, authenticity, availability",null,null,null,null,{"$f":"'AT-Matrix'!M5","v":"4.4.1.1"}]
[null,1,"IID1","software in EVSE","Inadmissible influence through downloading legally relevant software","integrity, authenticity, availability",null,null,null,null,{"$f":"'AT-Matrix'!N5","v":"NA"}]
[null,1,"IIR2","software in EVSE","Inadmissible influence through replacing or removing legally relevant components","integrity, authenticity, availability",null,null,null,null,{"$f":"'AT-Matrix'!O5","v":"4.5.2"}]
[null,1,"IIT1","software in EVSE","Inadmissible influence through man in the middle","integrity, authenticity, availability",null,null,null,null,{"$f":"'AT-Matrix'!P5","v":"NA"}]
[null,1,"IIA2","software in EVSE","Inadmissible influence through accidental modification","integrity, authenticity, availability",null,null,null,null,{"$f":"'AT-Matrix'!Q5","v":"4.4.1"}]
[null,1,"IIS1","software in EVSE","Inadmissible influence through incorrect identification of software","integrity, authenticity, availability",null,null,null,null,{"$f":"'AT-Matrix'!R5","v":"4.6.1"}]
[null,1,{"$f":"'AT-Matrix'!S$3","v":"IIX1"},"software in EVSE",{"$f":"'AT-Matrix'!S$2","v":"Additional attack vector 1"},"integrity, authenticity, availability",null,null,null,null,{"$f":"'AT-Matrix'!S5","v":"-"}]
[null,1,{"$f":"'AT-Matrix'!T$3","v":"IIX2"},"software in EVSE",{"$f":"'AT-Matrix'!T$2","v":"Additional attack vector 2"},"integrity, authenticity, availability",null,null,null,null,{"$f":"'AT-Matrix'!T5","v":"-"}]
{"$rows_left_out":194}
{"sheet":"Risk analysis","index":4,"n_rows":499,"n_cols":15,"rows_kept":499,"cut":false,"hidden":false,"merged":[[1,7,1,9],[5,1,6,1],[2,1,2,14],[5,2,6,2],[3,2,3,14],[4,2,4,14],[5,14,6,14],[5,3,6,3],[5,4,6,4],[5,10,6,10],[5,11,6,11],[5,13,6,13],[1,10,1,13]]}
[]
[null,"Risk analysis according to the WELMEC Guide 7.6:2021"]
[null,"*Impact score:"]
[null,"1/3","for attacks needing to be repeated for each individual measurement event"]
[null,1,"for attacks executed once affecting all future (or past)"]
[null,"Asset Nr.","DELETE Threat Nr.","Attack Nr.","Attack vector description","Time","Expertise","Knowledge","Window of opportunity","Equipment","Total resilience","Probability score","Impact score*","Risk","Justification"]
[null,null,null,null,null,"[0 to 19]","[0 to 8]","[0 to 11]","[0 to 10]","[0 to 9]",null,null,"[1 ; 1/3]"]
[null,null,null,null,null,null,null,null,null,null,{"$f":"SUM(F8:J8)","v":0},{"$f":"VLOOKUP(K8,System!$D$23:$F$27,3,TRUE)","v":5},1,{"$f":"L8*M8","v":5}]
[null,null,null,null,null,null,null,null,null,null,{"$f":"SUM(F9:J9)","v":0},{"$f":"VLOOKUP(K9,System!$D$23:$F$27,3,TRUE)","v":5},1,{"$f":"L9*M9","v":5}]
[null,null,null,null,null,null,null,null,null,null,0,{"$f":"VLOOKUP(K10,System!$D$23:$F$27,3,TRUE)","v":5},1,5]
[null,null,null,null,null,null,null,null,null,null,0,{"$f":"VLOOKUP(K11,System!$D$23:$F$27,3,TRUE)","v":5},1,5]
[null,null,null,null,null,null,null,null,null,null,0,{"$f":"VLOOKUP(K12,System!$D$23:$F$27,3,TRUE)","v":5},1,5]
[null,null,null,null,null,null,null,null,null,null,0,{"$f":"VLOOKUP(K13,System!$D$23:$F$27,3,TRUE)","v":5},1,5]
[null,null,null,null,null,null,null,null,null,null,0,{"$f":"VLOOKUP(K14,System!$D$23:$F$27,3,TRUE)","v":5},1,5]
[null,null,null,null,null,null,null,null,null,null,0,{"$f":"VLOOKUP(K15,System!$D$23:$F$27,3,TRUE)","v":5},1,5]
[null,null,null,null,null,null,null,null,null,null,0,{"$f":"VLOOKUP(K16,System!$D$23:$F$27,3,TRUE)","v":5},1,5]
[null,null,null,null,null,null,null,null,null,null,0,{"$f":"VLOOKUP(K17,System!$D$23:$F$27,3,TRUE)","v":5},1,5]
[null,null,null,null,null,null,null,null,null,null,0,{"$f":"VLOOKUP(K18,System!$D$23:$F$27,3,TRUE)","v":5},1,5]
[null,null,null,null,null,null,null,null,null,null,0,{"$f":"VLOOKUP(K19,System!$D$23:$F$27,3,TRUE)","v":5},1,5]
[null,null,null,null,null,null,null,null,null,null,0,{"$f":"VLOOKUP(K20,System!$D$23:$F$27,3,TRUE)","v":5},1,5]
{"$rows_left_out":480}
{"sheet":"Table 7-1 Time","index":5,"n_rows":16,"n_cols":4,"rows_kept":16,"cut":false,"hidden":false,"merged":[[1,7,1,9],[4,1,4,3],[3,1,3,3],[2,1,2,3]]}
[]
[null,"WELMEC Guide 7.6:2021 Annex B - Tables"]
[]
[null,"WELMEC Guide 7.6:2021 Software Risk Assessment"]
[null,"Table 7-1: Point scores for elapsed time"]
[null,"Elapsed Time","Points","Remarks"]
[null,"less than 1 day",0,"An assumed attacker with the needed expertise, knowledge and equipment, who has access to the instrument can implement the considered attack vector in less than one day.\n"]
[null,"less than 1 week",1,"An assumed attacker with the needed expertise, knowledge and equipment, who has access to the instrument can implement the considered attack vector in less than one week, as the attacker needs to prepare a simple script to perform the attack or perform a simple strength password search.\n"]
[null,"less than 2 weeks",2,"An assumed attacker with the needed expertise, knowledge and equipment, who has access to the instrument can implement the considered attack vector in less than two weeks, as the attacker needs to prepare a simple program to perform the attack or perform a simple strength password search.\n"]
[null,"less than 1 month",4,"An assumed attacker lacks in the needed expertise, knowledge or equipment, or does not have the access to the instrument and can implement the considered attack vector in less than one month, as the attacker needs to prepare a moderate complex script to perform the attack or perform a moderate strength password search.\n"]
[null,"less than 2 months",7,"An assumed attacker lacks in the needed expertise, knowledge or equipment, or does not have the access to the instrument and can implement the considered attack vector in less than two months, as the attacker needs to prepare a moderate complex program to perform the attack or perform a moderate strength password search.\n"]
[null,"less than 3 months",10,"An assumed attacker lacks in the needed expertise, knowledge or equipment, or does not have the access to the instrument and can implement the considered attack vector in less than three months, as the attacker needs to prepare a moderate complex program to perform the attack or perform a moderate strength password search.\n"]
[null,"less than 4 months",13,"An assumed attacker lacks in the needed expertise, knowledge or equipment, or does not have the access to the instrument and can implement the considered attack vector in less than four months, as the attacker needs to prepare a complex program to perform the attack or perform a strong strength password search.\n"]
[null,"less than 5 months",15,"An assumed attacker lacks in the needed expertise, knowledge or equipment, or does not have the access to the instrument and can implement the considered attack vector in less than four months, as the attacker needs to prepare a complex program and infrastructure to perform the attack or perform a strong strength password search or simple cryptographic key.\n"]
[null,"less than 6 months",17,"An assumed attacker lacks in the needed expertise, knowledge or equipment, or does not have the access to the instrument and can implement the considered attack vector in less than four months, as the attacker needs to prepare a complex program and infrastructure to perform the attack or perform a strong strength password search or moderate cryptographic key.\n"]
[null,"more than 6 months",19,"An assumed attacker will need longer than half a year to implement the attack. This includes both steps performed on the actual instrument and preparatory work performed elsewhere, as the attacker needs to prepare a complex program and infrastructure to perform the attack or perform a strong strength password search or strong crypto-graphic key.\n"]

{"sheet":"Table 7-2 Expertise","index":6,"n_rows":10,"n_cols":4,"rows_kept":10,"cut":false,"hidden":false,"merged":[[4,1,4,3],[1,7,1,9],[2,1,2,3],[3,1,3,3]]}
[]
[null,"WELMEC Guide 7.6:2021 Annex B - Tables"]
[]
[null,"WELMEC Guide 7.6:2021 Software Risk Assessment"]
[null,"Table 7-2: Point scores for expertise "]
[null,"Expertise","Points","Remarks"]
[null,"Layman",0,"With respect to IT skills, a layman is any person able to browse websites with a PC.\n"]
[null,"Proficient",3,"A proficient user would be anyone able to find, install and use specialized software (such as a network sniffer) for a specific task.\n"]
[null,"Expert",6,"Anyone able to write, build and use specific software to perform a certain task would count as an expert.\n"]
[null,"Multiple expert",8,"The expertise level “multiple expert” should only be chosen when expertise in more than one field (software development, cryptography, hardware development) is required to implement an attack.\n"]

{"sheet":"Table 7-3 Knowledge","index":7,"n_rows":10,"n_cols":4,"rows_kept":10,"cut":false,"hidden":false,"merged":[[4,1,4,3],[1,7,1,9],[2,1,2,3],[3,1,3,3]]}
[]
[null,"WELMEC Guide 7.6:2021 Annex B - Tables"]
[]
[null,"WELMEC Guide 7.6:2021 Software Risk Assessment"]
[null,"Table 7-3: Point scores for knowledge of the system "]
[null,"Knowledge of the system","Points","Remarks"]
[null,"Public",0,"The knowledge needed to implement the attack is publicly available. Any information that can be found by searching the Internet falls into this category.\n"]
[null,"Restricted",3,"Examples for restricted knowledge are user manuals only shipped together with an instrument. Such information is available only to a restricted group of people and not to the public.\n"]
[null,"Sensitive",7,"Information only known to the manufacturer and authorized persons. An example for sensitive information would be connection settings only shared between the manufacturer and the user.\n"]
[null,"Critical",11,"Information only known to a limited number of employees of the manufacturer and possibly the conformity assessment body are classified as “critical”. A password set by a verification officer would also fall into this category.\n"]

{"sheet":"Table 7-4 Opportunity","index":8,"n_rows":11,"n_cols":4,"rows_kept":11,"cut":false,"hidden":false,"merged":[[4,1,4,3],[1,7,1,9],[2,1,2,3],[3,1,3,3]]}
[]
[null,"WELMEC Guide 7.6:2021 Annex B - Tables"]
[]
[null,"WELMEC Guide 7.6:2021 Software Risk Assessment"]
[null,"Table 7-4: Points scores for window of opportunity "]
[null,"Window of opportunity","Points","Remarks"]
[null,"Unnecessary/ unlimited access",0,"Unnecessary/unlimited access signifies that an attacker does not need to have access to the instrument to implement an attack or that there is no risk of being detected during access.\n"]
[null,"Easy ",1,"Access qualifies as easy if access to the instrument is obtainable without difficulty and if it does have to last longer than a day.\n"]
[null,"Moderate",4,"If an attacker does not need to have access to the instrument for longer than a month and if the access is probably detected this qualifies as moderate access.\n"]
[null,"Difficult",10,"Difficult access signifies that an attacker will need to directly access the instrument for more than a month and detection is highly probable.\n"]
[null,"None","**","If access to the measuring system is impossible due to time constraints, the associated attack scenario does not need to be evaluated.\n"]

{"sheet":"Table 7-5 Equipment","index":9,"n_rows":10,"n_cols":4,"rows_kept":10,"cut":false,"hidden":false,"merged":[[4,1,4,3],[1,7,1,9],[2,1,2,3],[3,1,3,3]]}
[]
[null,"WELMEC Guide 7.6:2021 Annex B - Tables"]
[]
[null,"WELMEC Guide 7.6:2021 Software Risk Assessment"]
[null,"Table 7-5: Point scores for equipment "]
[null,"Equipment","Points","Remarks"]
[null,"Standard",0,"Standard equipment is any equipment readily available such as any common tool on a PC or software that can be freely downloaded from the Internet.\n"]
[null,"Specialized",4,"If a tool needs to be bought or can be written without major effort, this falls into the category of specialized equipment.\n"]
[null,"Bespoke",7,"Bespoke equipment would be highly sophisticated software that needs to be developed specially for the purpose of attacking the instrument.\n"]
[null,"Multiple bespoke",9,"The level multiple bespoke should only be used if several bespoke tools for different purposes (cryptanalysis, software development etc.) are needed.\n"]

{"sheet":"System","index":10,"n_rows":40,"n_cols":6,"rows_kept":40,"cut":false,"hidden":false,"merged":[[39,3,39,4],[38,3,38,4],[32,3,32,4],[34,3,34,4],[35,3,35,4],[36,3,36,4],[37,3,37,4],[0,0,0,5],[28,3,28,4],[29,3,29,4],[30,3,30,4],[31,3,31,4]]}
["Software risk analysis according to WELMEC Guide 7.6 chapter 4.1"]
[]
[null,null,null,"Status"]
["Document Nr.","6030.55F01",null,"NA","Not applicable"]
["Created on/by","25.01.2023/Baha",null,"AS","Acceptable solution applied"]
["Modified on","15.05.2025",null,"RA","Risk analysis"]
["Modified by","FREI",null,"BO","RA & AS"]
["Version Nr.","1.8",null,"-","Not evaluated"]
["Verified on/by","05.12.2023/Couv"]
["Original in","QM-Dokumente_6030"]
[]
[null,null,null,"Impact"]
[null,null,null,1,"for attacks executed once affecting all future (or past)"]
[null,null,null,{"$f":"1/3","v":0.33333333333333331},"for attacks needing to be repeated for each individual measurement event"]
[]
[]
[]
[]
[]
[]
{"$rows_left_out":20}